{"text_format":"3","workbook":"xlsx","n_sheets":7,"sheets":["Instructions 1.1","Assessment","Outputs","Definitions","Library of Steps","Report","Config"],"not_rendered":{"macros":1,"defined_names":6},"read":"whole","date_system":"1900"}

{"sheet":"Instructions 1.1","index":0,"n_rows":15,"n_cols":5,"rows_kept":15,"merged":[[0,0,0,1],[1,0,1,1],[2,0,2,1],[3,0,3,1],[8,0,8,1],[9,0,9,1]]}
["          Overview",null,null,"Updated: 11/04/21 Version: 1.1"]
["This Equal Access Agency Assessment Tool helps homeless housing and service providers assess their compliance with regulations and best practices. This tool is for agencies internal use only. This tool is intended for administrative staff, however, front line staff may also benefit from reading the tool and assisting in the assessment process. This tool is not official program guidance or legal advice that may be important to comply with local, state or federal privacy laws.\n\nFor each attribute, for example, \"Agency/Project has a Written Policy\", use the drop down to select \"Yes\", \"No\", \"Y\", or \"N\". At the bottom of the \"Assessment\" tab, click on the \"Update Assessment Report\" button.  This will populate and update the \"Priority Steps\" report tab. Several items on the \"Assessment\" tab must be filled out before the report is populated with recommendations.\n\nEach response is weighted based on the elements that are key to ensuring equal access.  Some of these goals build on each other and the items to the left must be in place before meeting standards that are to the right. As such, the items to the left have a higher weight value.\n\n"]
[]
["          Tab Descriptions",{"$nulls":3}," "]
["Assessment","The Assessment contains a list of Equal Access goals and attributes related to those goals.  Once the assessment is completed and the button on the bottom of the assessment tab is clicked, the Priority Steps Report will be generated.  "]
["Priority Steps","The Priority Steps gives a list of three steps to complete to help the agency move towards a more inclusive and safe environment.  Once the steps are completed, the items can be updated on the Assessment tab and the \"Update Assessment Tab\" button can be clicked to generate three new steps on the Priority Steps Report. "]
["Definitions","This is a list of definitions that can be helpful when assessing and updating policies and standards."]
["Library of Steps","The Library of Steps tab includes a set of all activities that can be carried out to meet challenges found during the assessment process."]
[]
["          Assessment Tab Descriptions"]
["Item #","This is a reference number to identify equal access goal and support discussion."]
["Equal Access Goal","These goals reflect the Equal Access Rule and are informed by input from leaders in homelessness issues and transgender equality.  "]
["Agency/Project has a Written Policy","Agency has written Policies and Procedures or Standard Operating Procedures that include non-discrimination, respecting individuals and confidentiality."]
["Staff, Volunteers and Vendors are Trained to Comply with the Written Policy","Training should occur in a consistent and accessible manner. Training should informed by best practices in transferring knowledge. Documentation of training attendance should be on file. Staff should be retrained on an annual basis. "]
["All Clients are Aware of the Agency/Project Policy","Client awareness is achieved by verbal discussion during intake, behavior agreement when enrolling and a posted notice that states rights, responsibilities and expectations."]
{"$rows_left_out":1}
{"sheet":"Assessment","index":1,"n_rows":57,"n_cols":9,"rows_kept":57,"merged":[[1,0,1,1]]}
["Item #","Equal Access Goal","Agency/Project has a Written Policy","Staff, Volunteers and Vendors are Trained to Comply with the Written Policy","All Clients are Aware of the Agency/Project Policy","yes/no add","red/green multiplier","category add"]
[]
[null,"Sample Response Options and Scoring"]
[]
[1,"Agency is committed and intends to comply with HUD's Equal Access Rule (if your agency receives HUD funding for shelter or services, your agency is required to meet these standards) and State and municipal laws.  ",{"$nulls":3},3,{"$f":"F5*1.25","v":3.75},{"$f":"G5*1.6","v":6},1]
[2,"For an agency or project legally permitted to segregate services based on gender, the agency serves all eligible clients who identify with that gender or whose gender identity aligns most closely with that gender.",{"$nulls":3},0,{"$f":"F6*1.5","v":0},0,1]
[3,"For an agency or project legally permitted to segregate services based on gender, the agency will not deny access because the client identification documents have a different gender marker than the client or potential client presenting for service.",{"$nulls":3},6,{"$f":"F7*1.5","v":9},14.4,1]
[4,"Agency or project will not consider a client or potential client ineligible because their appearance or behavior does not conform to gender stereotypes.",{"$nulls":3},4,{"$f":"F8*1.5","v":6},9.600000000000001,1]
[5,"Agency or project does not ask questions or seek information concerning a person’s anatomy or medical history beyond elements necessary for the purpose of providing services.",{"$nulls":3},6,{"$f":"F9*1.25","v":7.5},12,1]
[6,"For an agency or project prohibited from to segregate services based on gender, the agency will serve all individuals who are eligible for the project.",{"$nulls":3},3,{"$f":"F10*1.5","v":4.5},7.2,1]
[7,"If the Agency operates a family shelter, the Agency does not expel or decline a client of any gender if they are otherwise eligible for services.",{"$nulls":3},5,{"$f":"F11*1.5","v":7.5},12,1]
[8,"If the Agency operates a family shelter, the Agency does not expel or decline clients based on their male gender identity, regardless of age.",{"$nulls":3},0,{"$f":"F12*1.5","v":0},0,1]
[9,"Agency uses appropriate, inclusive language in communications, publications, trainings, personnel handbooks and other policy documents that affirms the agency’s commitment to serving all eligible clients in adherence with the Equal Access Rule.",{"$nulls":3},0,{"$f":"F13*1.25","v":0},0,1]
[10,"Agency makes Equal Access Rule policies and procedures publicly available on the agency's website and through other commonly used public notification processes.",{"$nulls":3},3,{"$f":"F14","v":3},4.800000000000001,1]
[11,"Agency ensures staff, volunteers and contractors are provided a copy of the Agency's policies and practices regarding Equal Access requirements. ",{"$nulls":3},5,{"$f":"F15","v":5},8,1]
{"$rows_left_out":43}
{"sheet":"Outputs","index":2,"n_rows":1,"n_cols":4,"rows_kept":1}
["Item","Goal","Next Steps","Score"]

{"sheet":"Definitions","index":3,"n_rows":43,"n_cols":1,"rows_kept":43}
["Glossary of Gender Identifying Terms and Definitions "]
["Assigned/Designated Sex at Birth: "]
["Frequently a binary designation of “male” or “female” "]
["Assigned at birth typically by a medical professional (e.g., sex listed on birth certificate) "]
["Based on the person’s internal or external anatomy at birth"]
["May or may not correspond to one’s gender identity or expression"]
["Cis-Gender: "]
["Refers to a non-transgender person"]
["The prefix “cis” means “matches”"]
["Thus, this means that one’s sex assigned at birth “matches” one’s gender identity "]
["Gender Identity: "]
["Internal or innate sense of being male, female, or another gender "]
["May or may not match their assigned sex at birth "]
["May not be visible based on outward appearance "]
["Gender Expression: "]
{"$rows_left_out":29}
{"sheet":"Library of Steps","index":4,"n_rows":54,"n_cols":5,"rows_kept":54,"merged":[[13,0,13,4],[18,0,18,4],[27,0,27,4],[35,0,35,4],[41,0,41,4],[47,0,47,4]]}
["Item #","Attribute","Agency/Project has a Written Policy","Staff, Volunteers and Contractors are Trained to Comply with the Written Policy","All Clients are Aware of the Agency/Project Policy"]
[1,"Agency is committed and intends to comply with HUD's Equal Access Rule (if your agency receives HUD funding for shelter or services, your agency is required to meet these standards) and State and municipal laws.  ","Meet with the agency's Board and administrators to discuss the importance of the Equal Access Rule, how to be compliant and gaps or areas for improvement at your agency.  ","Train staff, volunteers and contractors on the agency's commitment and intention to comply with the Equal Access Rule.","Educate clients on agency's commitment and intention to comply with the Equal Access Rule and the availability of the agency's Policies and Procedures."]
[2,"For an agency or project legally permitted to segregate services based on gender, the agency serves all eligible clients who identify with that gender or whose gender identity aligns most closely with that gender.","For an agency or project legally permitted to segregate services based on gender, develop a policy statement and procedures to ensure that staff, volunteers and contractors serve all eligible clients that identify with that gender or whose gender identity aligns most closely with that gender.","For an agency or project legally permitted to segregate services based on gender, train staff, volunteers and contractors to serve all eligible clients who identify with that gender or whose gender identity aligns most closely with that gender.","For an agency  or projectlegally permitted to segregate services based on gender, educate clients on the agency's policy to serve all eligible clients who identify with that gender or whose gender identity aligns most closely with that gender."]
[3,"For an agency or project legally permitted to segregate services based on gender, the agency will not deny access because the client identification documents have a different gender marker than the client or potential client presenting for service.","For an agency legally permitted to segregate services based on gender, develop a policy statement and procedures to ensure that staff, volunteers and contractors do not deny access because the agency possesses identity documents indicating a sex different than the gender with which the client or potential client identifies.","For an agency or project legally permitted to segregate services based on gender, train staff, volunteers and contractors on the agency's policy that prohibits denying access because the agency possesses identity documents indicating a sex different than the gender with which the client or potential client identifies.","For an agency or project legally permitted to segregate services based on gender, educate clients on the agency's commitment to not deny access because the agency possesses identity documents indicating a sex different than the gender with which the client or potential client identifies."]
[4,"Agency or project will not consider a client or potential client ineligible because their appearance or behavior does not conform to gender stereotypes.","For an agency or project legally permitted to segregate services based on gender, develop a policy statement and procedures to ensure that staff, volunteers and contractors will not consider a client or potential client ineligible because their appearance or behavior does not conform to gender stereotypes.","For an agency or project legally permitted to segregate services based on gender, train staff, volunteers and contractors to not consider a client or potential client ineligible because their appearance or behavior does not conform to gender stereotypes.","For an agency or project legally permitted to segregate services based on gender, educate clients on the agency's commitment to not consider a client or potential client ineligible because their appearance or behavior does not conform to gender stereotypes."]
[5,"Agency or project does not ask questions or seek information concerning a person’s anatomy or medical history beyond elements necessary for the purpose of providing services.","Develop a policy statement and procedures to ensure that staff, volunteers and contractors do not ask questions or otherwise seek information or documentation concerning a person’s anatomy or medical history.","Train staff, volunteers and contractors on the agency's policy that prohibits asking questions or otherwise seek information or documentation concerning a person’s anatomy or medical history.","Ensure clients understand that staff will not ask questions or otherwise seek information or documentation concerning the client's anatomy or medical history."]
[6,"For an agency or project prohibited from to segregate services based on gender, the agency will serve all individuals who are eligible for the project.","Develop a policy statement and procedures to ensure that staff, volunteers and contractors serve all individuals who are eligible for the project.","Train staff, volunteers and contractors on the agency's commitment serve all individuals that are eligible for the project.","Publicize the agency's commitment to serve all individuals, regardless of gender, in project literature."]
[7,"If the Agency operates a family shelter, the Agency does not expel or decline a client of any gender if they are otherwise eligible for services.","Develop a policy statement and procedures to ensure that staff, volunteers and contractors do not expel or decline a client of any gender if they are otherwise eligible for services.","Train staff, volunteers and contractors on the agency's commitment to not expel or decline a client of any gender if they are otherwise eligible for services.","Publicize the agency's commitment to serve all families, regardless of gender, in project literature."]
[8,"If the Agency operates a family shelter, the Agency does not expel or decline clients based on their male gender identity, regardless of age.","Develop a policy statement and procedures to ensure that staff, volunteers and contractors do not expel or decline clients based on their male gender identity, regardless of age.","Train staff, volunteers and contractors on the agency's commitment to not expel or decline clients based on their male gender identity, regardless of age.","Educate clients on the agency's commitment to not expel or decline clients based on their male gender identity, regardless of age."]
[9,"Agency uses appropriate, inclusive language in communications, publications, trainings, personnel handbooks and other policy documents that affirms the agency’s commitment to serving all eligible clients in adherence with the Equal Access Rule.","Develop a policy statement and procedures for the addition of inclusive language in communications, publications, trainings, personnel handbooks and other policy documents that affirms the agency’s commitment to serving all eligible clients in adherence with the Equal Access Rule.","Train staff, volunteers and contractors on the agency's commitment to inclusive language in communications, publications, trainings, personnel handbooks and other policy documents that affirms the agency’s commitment to serving all eligible clients in adherence with the Equal Access Rule.","Educate clients on the agency's commitment to inclusive language in communications, publications, trainings, personnel handbooks and other policy documents that affirm the agency’s commitment to serving all eligible clients in adherence with the Equal Access Rule."]
[10,"Agency makes Equal Access Rule policies and procedures publicly available on the agency's website and through other commonly used public notification processes.","Develop a policy statement and procedures on making Equal Access Rule policies and procedures publicly available on the agency's website and through other commonly used public notification processes.","Train staff, volunteers and contractors on availability of the Agency's Equal Access Rule policies and procedures on the agency's website and through other commonly used public notification processes.","Educate clients on availability of the Agency's Equal Access Rule policies and procedures on the agency's website and through other commonly used public notification processes."]
[11,"Agency ensures staff, volunteers and contractors are provided a copy of the Agency's policies and practices regarding Equal Access requirements. ","Develop a policy statement and procedures on providing a copy of the agency's policies and practices regarding Equal Access requirements to staff, volunteers and contractors. ","Train staff, volunteers and contractors that all staff, volunteers and contractors are required to understand and follow the agency's Policies and Procedures.","Educate clients that all staff, volunteers and contractors are required to understand and follow the agency's Policies and Procedures."]
[12,"Agency includes \"gender identity\" and \"gender expression\" to the list of attributes that are protected from discrimination in the Agency's Policies and Procedures.","In the list attributes that are protected from discrimination include \"gender identity\" and \"gender expression\".  If the agency's Policies and Procedures don't include a list of attributes, add them.  ","Train staff, volunteers and contractors on the agency's inclusion  of \"gender identity\" and \"gender expression\" to list of attributes that are protected from discrimination in the agency's Policies and Procedures.","Educate clients on the agency's inclusion of \"gender identity\" and \"gender expression\" to list of attributes that are protected from discrimination in the agency's Policies and Procedures."]
["Harassment Policy"]
[13,"Agency includes transgender and nonbinary in the list of groups vulnerable to harassment and/or list of protected groups. ","In the list of protected groups within the agency's Policies and Procedures, add transgender and non-binary.  If your agency does not list protected groups, add a list and include these populations.","Train staff, volunteers and contractors on the agency's inclusion of transgender and non-binary in the list of groups vulnerable to harassment and/or list of protected groups.","Educate clients on the agency's inclusion of transgender and non-binary in the list of groups vulnerable to harassment and/or list of protected groups."]
{"$rows_left_out":40}
{"sheet":"Report","index":5,"n_rows":57,"n_cols":5,"rows_kept":57,"hidden":true}
[]
[]
[]
[{"$nulls":3},"Library","Assessment"]
[16,23.400000000000002,null,{"$f":"MATCH($A5,'Library of Steps'!$A$1:$A$99,0)","v":18},{"$f":"MATCH($A5,Assessment!$A$1:$A$100,0)","v":21}]
[30,16.799999999999997,null,{"$f":"MATCH($A6,'Library of Steps'!$A$1:$A$99,0)","v":34},{"$f":"MATCH($A6,Assessment!$A$1:$A$100,0)","v":37}]
[45,16.5,null,{"$f":"MATCH($A7,'Library of Steps'!$A$1:$A$99,0)","v":52},{"$f":"MATCH($A7,Assessment!$A$1:$A$100,0)","v":55}]
[31,14,null,{"$f":"MATCH($A8,'Library of Steps'!$A$1:$A$99,0)","v":35},{"$f":"MATCH($A8,Assessment!$A$1:$A$100,0)","v":38}]
[7,12,null,{"$f":"MATCH($A9,'Library of Steps'!$A$1:$A$99,0)","v":8},{"$f":"MATCH($A9,Assessment!$A$1:$A$100,0)","v":11}]
[21,12,null,{"$f":"MATCH($A10,'Library of Steps'!$A$1:$A$99,0)","v":24},{"$f":"MATCH($A10,Assessment!$A$1:$A$100,0)","v":27}]
[36,12,null,{"$f":"MATCH($A11,'Library of Steps'!$A$1:$A$99,0)","v":41},{"$f":"MATCH($A11,Assessment!$A$1:$A$100,0)","v":44}]
[41,11.25,null,{"$f":"MATCH($A12,'Library of Steps'!$A$1:$A$99,0)","v":47},{"$f":"MATCH($A12,Assessment!$A$1:$A$100,0)","v":50}]
[12,10,null,{"$f":"MATCH($A13,'Library of Steps'!$A$1:$A$99,0)","v":13},{"$f":"MATCH($A13,Assessment!$A$1:$A$100,0)","v":16}]
[4,9.600000000000001,null,{"$f":"MATCH($A14,'Library of Steps'!$A$1:$A$99,0)","v":5},{"$f":"MATCH($A14,Assessment!$A$1:$A$100,0)","v":8}]
[33,9,null,{"$f":"MATCH($A15,'Library of Steps'!$A$1:$A$99,0)","v":38},{"$f":"MATCH($A15,Assessment!$A$1:$A$100,0)","v":41}]
{"$rows_left_out":43}
{"sheet":"Config","index":6,"n_rows":13,"n_cols":7,"rows_kept":13,"hidden":true}
[]
[]
[null,"Row Weight",null,"Category","Weight",null,"Yes/No"]
[null,1,null,1,1.6,null,"Yes"]
[null,1.25,null,2,1.5,null,"No"]
[null,1.5,null,3,1.4,null,"N/A"]
[{"$nulls":3},4,1.3]
[{"$nulls":3},5,1.2]
[{"$nulls":3},6,1.1]
[{"$nulls":3},7,1]
[]
[null,"Display Results"]
[null,3]